BDBM453255 2-(3-(4-((4-(1H-pyrazol-4-yl)phenyl)amino)-7,8-dihydro-5H-pyrano[4,3-d]pyrimidin-2-yl)phenoxy)-N-isopropylacetamide::US10729691, Example 40
SMILES CC(C)NC(=O)COc1cccc(c1)-c1nc2CCOCc2c(Nc2ccc(cc2)-c2cn[nH]c2)n1
InChI Key InChIKey=LBBASXWNBVHKGX-UHFFFAOYSA-N
Data  2 IC50
  Tab Delimited (TSV)   2D SDfile   Computed 3D by Vconf -m prep SDfile
Find this compound or compounds like it in BindingDB:
Activity Spreadsheet -- Enzyme Inhibition Constant Data from BindingDB
Found 2 hits for monomerid = 453255
TargetPutative sugar transporter(Plasmodium falciparum)
Kadmon
US Patent
LigandPNGBDBM453255(2-(3-(4-((4-(1H-pyrazol-4-yl)phenyl)amino)-7,8-dih...)
Affinity DataIC50:  55nM. Assay description: Parasite cultures were seeded in 96-well plates (1% hematocrit, 1-2% starting parasitemia, 100 μL total volume) with varying concentrations of t...
Ligand InfoPC cidPC sid
In DepthDetails US Patent
TargetSolute carrier family 2, facilitated glucose transporter member 1(Homo sapiens (Human))
Kadmon
US Patent
LigandPNGBDBM453255(2-(3-(4-((4-(1H-pyrazol-4-yl)phenyl)amino)-7,8-dih...)
Affinity DataIC50:  55nM. Assay description: HT1080 cells (as well as other cell types) were plated to confluency in 96-well plates. Cells were exposed to the combination of 10 μM Oligomyci...
Ligand InfoPC cidPC sid
In DepthDetails US Patent