BDBM50015539 4-(5-Cyclopentyloxycarbonylamino-1-propyl-1H-indol-3-ylmethyl)-3-methoxy-benzoic acid::CHEMBL422404
SMILES CCCn1cc(Cc2ccc(cc2OC)C(O)=O)c2cc(NC(=O)OC3CCCC3)ccc12
InChI Key InChIKey=DGNCWHJGPDCQIQ-UHFFFAOYSA-N
Data  1 KI
  Tab Delimited (TSV)   2D SDfile   Computed 3D by Vconf -m prep SDfile
Find this compound or compounds like it in BindingDB:
Activity Spreadsheet -- Enzyme Inhibition Constant Data from BindingDB
Found 1 hit for monomerid = 50015539
TargetCysteinyl leukotriene receptor 1(GUINEA PIG)
Ici Pharmaceuticals Group
Curated by ChEMBL
LigandPNGBDBM50015539(4-(5-Cyclopentyloxycarbonylamino-1-propyl-1H-indol...)
Affinity DataKi:  58nM. Assay description: Inhibition constant for displacement of [3H]-LTD4 on guinea pig lung parenchymal membranes.
In DepthDetails ArticlePubMed