BDBM50034765 3-[(2S,4S,5R)-5-((Z)-5-Carboxy-pent-2-enyl)-4-(2-hydroxy-phenyl)-[1,3]dioxan-2-ylmethoxy]-4-(2-imidazol-1-yl-ethoxy)-benzoic acid::CHEMBL288118
SMILES OC(=O)CC\C=C/C[C@@H]1CO[C@H](COc2cc(ccc2OCCn2ccnc2)C(O)=O)O[C@@H]1c1ccccc1O
InChI Key InChIKey=CHZKTNLUUNIFCP-CMOVNVCKSA-N
Data  1 IC50
  Tab Delimited (TSV)   2D SDfile   Computed 3D by Vconf -m prep SDfile
Find this compound or compounds like it in BindingDB:
Activity Spreadsheet -- Enzyme Inhibition Constant Data from BindingDB
Found 1 hit for monomerid = 50034765
TargetThromboxane-A synthase(Homo sapiens (Human))
Zeneca Pharmaceuticals
Curated by ChEMBL
LigandPNGBDBM50034765(3-[(2S,4S,5R)-5-((Z)-5-Carboxy-pent-2-enyl)-4-(2-h...)
Affinity DataIC50:  1.70E+3nM. Assay description: In vitro inhibitory activity against human microsomal thromboxane synthase.
In DepthDetails ArticlePubMed