BDBM50041112 2-(4-Dimethylamino-phenyl)-1H-quinolin-4-one::CHEMBL15011
SMILES CN(C)c1ccc(cc1)-c1cc(O)c2ccccc2n1
InChI Key InChIKey=JCICERHEBLRBAF-UHFFFAOYSA-N
Data  1 IC50
  Tab Delimited (TSV)   2D SDfile   Computed 3D by Vconf -m prep SDfile
Find this compound or compounds like it in BindingDB:
Activity Spreadsheet -- Enzyme Inhibition Constant Data from BindingDB
Found 1 hit for monomerid = 50041112
TargetTubulin beta-2B chain(Bos taurus)
School Of Pharmacy
Curated by ChEMBL
LigandPNGBDBM50041112(2-(4-Dimethylamino-phenyl)-1H-quinolin-4-one | CHE...)
Affinity DataIC50: >4.00E+4nM. Assay description: Inhibition of tubulin polymerization
In DepthDetails ArticlePubMed