BDBM50041114 6-(3,4-Dimethoxy-phenyl)-5H-[1,3]dioxolo[4,5-g]quinolin-8-one::CHEMBL15050
SMILES COc1ccc(cc1OC)-c1cc(O)c2cc3OCOc3cc2n1
InChI Key InChIKey=VNNVVLQSFWKLGZ-UHFFFAOYSA-N
Data  1 IC50
  Tab Delimited (TSV)   2D SDfile   Computed 3D by Vconf -m prep SDfile
Find this compound or compounds like it in BindingDB:
Activity Spreadsheet -- Enzyme Inhibition Constant Data from BindingDB
Found 1 hit for monomerid = 50041114
TargetTubulin beta-2B chain(Bos taurus)
School Of Pharmacy
Curated by ChEMBL
LigandPNGBDBM50041114(6-(3,4-Dimethoxy-phenyl)-5H-[1,3]dioxolo[4,5-g]qui...)
Affinity DataIC50: >4.00E+4nM. Assay description: Inhibition of tubulin polymerization
In DepthDetails ArticlePubMed