BDBM50041124 6-(4-Methoxy-phenyl)-5H-[1,3]dioxolo[4,5-g]quinolin-8-one::CHEMBL14584
SMILES COc1ccc(cc1)-c1cc(O)c2cc3OCOc3cc2n1
InChI Key InChIKey=NDNZFEQAUOGRDA-UHFFFAOYSA-N
Data  1 IC50
  Tab Delimited (TSV)   2D SDfile   Computed 3D by Vconf -m prep SDfile
Find this compound or compounds like it in BindingDB:
Activity Spreadsheet -- Enzyme Inhibition Constant Data from BindingDB
Found 1 hit for monomerid = 50041124
TargetTubulin beta-2B chain(Bos taurus)
School Of Pharmacy
Curated by ChEMBL
LigandPNGBDBM50041124(6-(4-Methoxy-phenyl)-5H-[1,3]dioxolo[4,5-g]quinoli...)
Affinity DataIC50: >4.00E+4nM. Assay description: Inhibition of tubulin polymerization
In DepthDetails ArticlePubMed