BDBM50041125 6-(2,3,4-Trimethoxy-phenyl)-5H-[1,3]dioxolo[4,5-g]quinolin-8-one::CHEMBL14809
SMILES COc1ccc(-c2cc(O)c3cc4OCOc4cc3n2)c(OC)c1OC
InChI Key InChIKey=YYFCKMGXGBYSNO-UHFFFAOYSA-N
Data  1 IC50
  Tab Delimited (TSV)   2D SDfile   Computed 3D by Vconf -m prep SDfile
Find this compound or compounds like it in BindingDB:
Activity Spreadsheet -- Enzyme Inhibition Constant Data from BindingDB
Found 1 hit for monomerid = 50041125
TargetTubulin beta-2B chain(Bos taurus)
School Of Pharmacy
Curated by ChEMBL
LigandPNGBDBM50041125(6-(2,3,4-Trimethoxy-phenyl)-5H-[1,3]dioxolo[4,5-g]...)
Affinity DataIC50: >4.00E+4nM. Assay description: Inhibition of tubulin polymerization
In DepthDetails ArticlePubMed