BDBM50041133 6,7-Dimethoxy-2-phenyl-1H-quinolin-4-one::CHEMBL14525
SMILES COc1cc2nc(cc(O)c2cc1OC)-c1ccccc1
InChI Key InChIKey=WYKXXNRFYDQUDT-UHFFFAOYSA-N
Data  1 IC50
  Tab Delimited (TSV)   2D SDfile   Computed 3D by Vconf -m prep SDfile
Find this compound or compounds like it in BindingDB:
Activity Spreadsheet -- Enzyme Inhibition Constant Data from BindingDB
Found 1 hit for monomerid = 50041133
TargetTubulin beta-2B chain(Bos taurus)
School Of Pharmacy
Curated by ChEMBL
LigandPNGBDBM50041133(6,7-Dimethoxy-2-phenyl-1H-quinolin-4-one | CHEMBL1...)
Affinity DataIC50:  1.80E+4nM. Assay description: Inhibition of tubulin polymerization
In DepthDetails ArticlePubMed