BDBM50060378 3-[5-(4-Fluoro-benzenesulfonylamino)-3-imidazol-1-ylmethyl-indol-1-yl]-propionic acid::CHEMBL295512
SMILES OC(=O)CCn1cc(Cn2ccnc2)c2cc(NS(=O)(=O)c3ccc(F)cc3)ccc12
InChI Key InChIKey=LETDBYAQRZLVRD-UHFFFAOYSA-N
Data  2 IC50
  Tab Delimited (TSV)   2D SDfile   Computed 3D by Vconf -m prep SDfile
Find this compound or compounds like it in BindingDB:
Activity Spreadsheet -- Enzyme Inhibition Constant Data from BindingDB
Found 2 hits for monomerid = 50060378
TargetThromboxane-A synthase(Homo sapiens (Human))
TBA
Curated by ChEMBL
LigandPNGBDBM50060378(3-[5-(4-Fluoro-benzenesulfonylamino)-3-imidazol-1-...)
Affinity DataIC50:  34nM. Assay description: Inhibitory activity against human platelet microsomal TXA2 synthase
In DepthDetails Article
TargetThromboxane-A synthase(Homo sapiens (Human))
TBA
Curated by ChEMBL
LigandPNGBDBM50060378(3-[5-(4-Fluoro-benzenesulfonylamino)-3-imidazol-1-...)
Affinity DataIC50:  34nM. Assay description: Activity against human platelet microsome Thromboxane synthase
In DepthDetails ArticlePubMed