BDBM50060388 3-{3-[2-(Propane-1-sulfonylamino)-ethyl]-5-pyridin-3-ylmethyl-phenyl}-propionic acid::CHEMBL113753
SMILES CCCS(=O)(=O)NCCc1cc(CCC(O)=O)cc(Cc2cccnc2)c1
InChI Key InChIKey=NEWMAOXVMHXXRT-UHFFFAOYSA-N
Data  1 IC50
  Tab Delimited (TSV)   2D SDfile   Computed 3D by Vconf -m prep SDfile
Find this compound or compounds like it in BindingDB:
Activity Spreadsheet -- Enzyme Inhibition Constant Data from BindingDB
Found 1 hit for monomerid = 50060388
TargetThromboxane-A synthase(Homo sapiens (Human))
Pfizer
Curated by ChEMBL
LigandPNGBDBM50060388(3-{3-[2-(Propane-1-sulfonylamino)-ethyl]-5-pyridin...)
Affinity DataIC50:  29nM. Assay description: Activity against human platelet microsome Thromboxane synthase
In DepthDetails ArticlePubMed