BDBM50060394 3-[3-[2-(4-Chloro-benzenesulfonylamino)-ethyl]-5-(1-pyridin-3-yl-vinyl)-phenyl]-propionic acid::CHEMBL117561
SMILES OC(=O)CCc1cc(CCNS(=O)(=O)c2ccc(Cl)cc2)cc(c1)C(=C)c1cccnc1
InChI Key InChIKey=FMMSMSALGORHKY-UHFFFAOYSA-N
Data  1 IC50
  Tab Delimited (TSV)   2D SDfile   Computed 3D by Vconf -m prep SDfile
Find this compound or compounds like it in BindingDB:
Activity Spreadsheet -- Enzyme Inhibition Constant Data from BindingDB
Found 1 hit for monomerid = 50060394
TargetThromboxane-A synthase(Homo sapiens (Human))
Pfizer
Curated by ChEMBL
LigandPNGBDBM50060394(3-[3-[2-(4-Chloro-benzenesulfonylamino)-ethyl]-5-(...)
Affinity DataIC50:  53nM. Assay description: Activity against human platelet microsome Thromboxane synthase
In DepthDetails ArticlePubMed