BDBM50060397 3-{3-[2-(Piperidine-1-sulfonylamino)-ethyl]-5-pyridin-3-ylmethyl-phenyl}-propionic acid::CHEMBL119035
SMILES OC(=O)CCc1cc(CCNS(=O)(=O)N2CCCCC2)cc(Cc2cccnc2)c1
InChI Key InChIKey=YFYJSJBIRHAOGC-UHFFFAOYSA-N
Data  1 IC50
  Tab Delimited (TSV)   2D SDfile   Computed 3D by Vconf -m prep SDfile
Find this compound or compounds like it in BindingDB:
Activity Spreadsheet -- Enzyme Inhibition Constant Data from BindingDB
Found 1 hit for monomerid = 50060397
TargetThromboxane-A synthase(Homo sapiens (Human))
Pfizer
Curated by ChEMBL
LigandPNGBDBM50060397(3-{3-[2-(Piperidine-1-sulfonylamino)-ethyl]-5-pyri...)
Affinity DataIC50:  43nM. Assay description: Activity against human platelet microsome Thromboxane synthase
In DepthDetails ArticlePubMed