BDBM50146456 (2E)-3-(3-hydroxyphenyl)-2-propenoic acid::(2E)-3-(3-hydroxyphenyl)acrylic acid::(2E)-3-(3-hydroxyphenyl)prop-2-enoic acid::(E)-3-(3-hydroxyphenyl)-2-propenoic acid::3-Coumaric acid::CHEMBL98521::trans-3-Hydroxycinnamate::trans-3-coumaric acid
SMILES OC(=O)\C=C\c1cccc(O)c1
InChI Key InChIKey=KKSDGJDHHZEWEP-SNAWJCMRSA-N
Data  6 IC50
  Tab Delimited (TSV)   2D SDfile   Computed 3D by Vconf -m prep SDfile
Find this compound or compounds like it in BindingDB:
Activity Spreadsheet -- Enzyme Inhibition Constant Data from BindingDB
Found 6 hits for monomerid = 50146456
TargetD-aspartate oxidase(Homo sapiens (Human))
Kitasato University
Curated by ChEMBL
LigandPNGBDBM50146456((2E)-3-(3-hydroxyphenyl)-2-propenoic acid | (2E)-3...)
Affinity DataIC50: >1.00E+7nM. Assay description: Inhibition of human recombinant N-terminal His-tagged DDO expressed in Escherichia coli BL21(DE3) using D-aspartate as substrate by colorimetric assa...
In DepthDetails ArticlePubMed
TargetD-amino-acid oxidase(Homo sapiens (Human))
Kitasato University
Curated by ChEMBL
LigandPNGBDBM50146456((2E)-3-(3-hydroxyphenyl)-2-propenoic acid | (2E)-3...)
Affinity DataIC50: >1.00E+7nM. Assay description: Inhibition of human recombinant N-terminal His-tagged DAO expressed in Escherichia coli BL21(DE3) using D-alanine as substrate by colorimetric assay
In DepthDetails ArticlePubMed
TargetAlpha-glucosidase MAL62(Saccharomyces cerevisiae)TBA
LigandPNGBDBM50146456((2E)-3-(3-hydroxyphenyl)-2-propenoic acid | (2E)-3...)
Affinity DataIC50:  1.27E+12nM. Assay description: Inhibition of baker's yeast alpha-glucosidase using p-nitrophenyl-alpha-D-glucopyranoside as substrate by spectrophotometry
In DepthDetails Article
TargetSerine racemase(Homo sapiens (Human))
Kitasato University
Curated by ChEMBL
LigandPNGBDBM50146456((2E)-3-(3-hydroxyphenyl)-2-propenoic acid | (2E)-3...)
Affinity DataIC50:  8.39E+6nM. Assay description: Inhibition of human recombinant N-terminal His-tagged serine racemase expressed in Escherichia coli BL21(DE3) using L-serine as substrate after 10 mi...
In DepthDetails ArticlePubMed
TargetAmyloid-beta precursor protein(Homo sapiens (Human))
Alma Mater Studiorum-University Of Bologna
Curated by ChEMBL
LigandPNGBDBM50146456((2E)-3-(3-hydroxyphenyl)-2-propenoic acid | (2E)-3...)
Affinity DataIC50: >1.00E+5nM. Assay description: Inhibition of self-induced amyloid beta (1 to 42) (unknown origin) aggregation by thioflavin T-based fluorometric assay
In DepthDetails ArticlePubMed
TargetD-amino-acid oxidase(Homo sapiens (Human))
Kitasato University
Curated by ChEMBL
LigandPNGBDBM50146456((2E)-3-(3-hydroxyphenyl)-2-propenoic acid | (2E)-3...)
Affinity DataIC50:  6.27E+6nM. Assay description: Inhibition of human recombinant N-terminal His-tagged DAO expressed in Escherichia coli BL21(DE3) using D-serine as substrate by colorimetric assay
In DepthDetails ArticlePubMed