BDBM50181324 CHEMBL205792::N-(7-(3-aminophenyl)-5-methoxybenzo[d]oxazol-2-yl)-2,5-dichlorobenzenesulfonamide::N-[7-(3-AMINOPHENYL)-5-METHOXY-1,3-BENZOXAZOL-2-YL]-2,5-DICHLOROBENZENESULFONAMIDE
SMILES COc1cc(-c2cccc(N)c2)c2oc(NS(=O)(=O)c3cc(Cl)ccc3Cl)nc2c1
InChI Key InChIKey=GAYYMURZGLJDCT-UHFFFAOYSA-N
Data  2 IC50
PDB links: 1 PDB ID matches this monomer.
  Tab Delimited (TSV)   2D SDfile   Computed 3D by Vconf -m prep SDfile
Find this compound or compounds like it in BindingDB:
Activity Spreadsheet -- Enzyme Inhibition Constant Data from BindingDB
Found 2 hits for monomerid = 50181324
TargetFructose-1,6-bisphosphatase 1(Homo sapiens (Human))TBA
LigandPNGBDBM50181324(CHEMBL205792 | N-(7-(3-aminophenyl)-5-methoxybenzo...)
Affinity DataIC50:  570nM. Assay description: Inhibition of recombinant C-terminal His-tagged human liver FBPase expressed in Escherichia coli BL21 (DE3)
TargetFructose-1,6-bisphosphatase 1(Homo sapiens (Human))TBA
LigandPNGBDBM50181324(CHEMBL205792 | N-(7-(3-aminophenyl)-5-methoxybenzo...)
Affinity DataIC50:  570nM. Assay description: Inhibition of human FBPase1