BDBM50192798 CHEMBL219349::N-((1R,2S,5R,7S)-5-carbamoylmethyl-adamantan-2-yl)-2-(5-cyano-pyridin-2-yl)-isobutyramide
SMILES CC(C)(C(=O)N[C@H]1C2C[C@@H]3C[C@H]1C[C@](CC(N)=O)(C3)C2)c1ccc(cn1)C#N
InChI Key InChIKey=ZFKLYMBYKJMHMS-ADYSRPFESA-N
Data  5 IC50
  Tab Delimited (TSV)   2D SDfile   Computed 3D by Vconf -m prep SDfile
Find this compound or compounds like it in BindingDB:
Activity Spreadsheet -- Enzyme Inhibition Constant Data from BindingDB
Found 5 hits for monomerid = 50192798
Target11-beta-hydroxysteroid dehydrogenase 1(Mus musculus (mouse))
Abbott Laboratories
Curated by ChEMBL
LigandPNGBDBM50192798(CHEMBL219349 | N-((1R,2S,5R,7S)-5-carbamoylmethyl-...)
Affinity DataIC50:  65nM. Assay description: Inhibition of mouse 11beta-HSD1 expressed in Escherichia coli
In DepthDetails ArticlePubMed
Target11-beta-hydroxysteroid dehydrogenase 1(Homo sapiens (Human))
Abbott Laboratories
Curated by ChEMBL
LigandPNGBDBM50192798(CHEMBL219349 | N-((1R,2S,5R,7S)-5-carbamoylmethyl-...)
Affinity DataIC50:  165nM. Assay description: Inhibition of human 11beta-HSD1 expressed in HEK293 cells
In DepthDetails ArticlePubMed
Target11-beta-hydroxysteroid dehydrogenase type 2(Mus musculus (mouse))
Abbott Laboratories
Curated by ChEMBL
LigandPNGBDBM50192798(CHEMBL219349 | N-((1R,2S,5R,7S)-5-carbamoylmethyl-...)
Affinity DataIC50:  1.50E+4nM. Assay description: Inhibition of mouse 11beta-HSD2
In DepthDetails ArticlePubMed
Target11-beta-hydroxysteroid dehydrogenase type 2(Homo sapiens (Human))
Abbott Laboratories
Curated by ChEMBL
LigandPNGBDBM50192798(CHEMBL219349 | N-((1R,2S,5R,7S)-5-carbamoylmethyl-...)
Affinity DataIC50: >1.00E+5nM. Assay description: Inhibition of human 11beta-HSD2
In DepthDetails ArticlePubMed
Target11-beta-hydroxysteroid dehydrogenase 1(Homo sapiens (Human))
Abbott Laboratories
Curated by ChEMBL
LigandPNGBDBM50192798(CHEMBL219349 | N-((1R,2S,5R,7S)-5-carbamoylmethyl-...)
Affinity DataIC50:  14nM. Assay description: Inhibition of human 11beta-HSD1 expressed in Escherichia coli
In DepthDetails ArticlePubMed