BDBM50230764 CHEMBL299954
SMILES CCCCc1ncc(\C=C(/Cc2cccs2)C(=O)NCC(O)=O)n1Cc1ccc(cc1)C(O)=O
InChI Key InChIKey=YSQZCCMUIGPELQ-XDHOZWIPSA-N
Data  1 IC50
  Tab Delimited (TSV)   2D SDfile   Computed 3D by Vconf -m prep SDfile
Find this compound or compounds like it in BindingDB:
Activity Spreadsheet -- Enzyme Inhibition Constant Data from BindingDB
Found 1 hit for monomerid = 50230764
LigandPNGBDBM50230764(CHEMBL299954)
Affinity DataIC50:  4.80nM. Assay description: Inhibition of [125I]AII binding to Angiotensin II receptor, type 1 of rat mesenteric arteries
In DepthDetails ArticlePubMed