BDBM50230771 CHEMBL55510
SMILES CCCCc1ncc(\C=C(/Cc2cccs2)C(O)=O)n1Cc1ccc(C(O)=O)c(O)c1
InChI Key InChIKey=NAXATXQGKODINZ-LFIBNONCSA-N
Data  1 IC50
  Tab Delimited (TSV)   2D SDfile   Computed 3D by Vconf -m prep SDfile
Find this compound or compounds like it in BindingDB:
Activity Spreadsheet -- Enzyme Inhibition Constant Data from BindingDB
Found 1 hit for monomerid = 50230771
LigandPNGBDBM50230771(CHEMBL55510)
Affinity DataIC50:  0.590nM. Assay description: Inhibition of [125I]AII binding to Angiotensin II receptor, type 1 of rat mesenteric arteries
In DepthDetails ArticlePubMed