BDBM50239187 CHEBI:30813::Decanoic Acid::Decanoic Acid Anion
SMILES CCCCCCCCCC(O)=O
InChI Key InChIKey=GHVNFZFCNZKVNT-UHFFFAOYSA-N
Data  2 KI  3 IC50  15 EC50
  Tab Delimited (TSV)   2D SDfile   Computed 3D by Vconf -m prep SDfile
Find this compound or compounds like it in BindingDB:
Activity Spreadsheet -- Enzyme Inhibition Constant Data from BindingDB
Found 20 hits for monomerid = 50239187
TargetG-protein coupled receptor 84(Homo sapiens (Human))
University Of Bonn
Curated by ChEMBL
LigandPNGBDBM50239187(CHEBI:30813 | Decanoic Acid | Decanoic Acid Anion)
Affinity DataKi:  1.78E+3nM. Assay description: Displacement of [3H]PSB-1584 from recombinant human GPR84 expressed in CHO cell membranes co-expressing beta-arrestin2 measured after 6 hrs by scinti...
In DepthDetails ArticlePubMed
TargetPeroxisome proliferator-activated receptor gamma(Homo sapiens (Human))
Chongqing Medical University
Curated by ChEMBL
LigandPNGBDBM50239187(CHEBI:30813 | Decanoic Acid | Decanoic Acid Anion)
Affinity DataKi:  2.20E+4nM. Assay description: Binding affinity to GST-tagged PPARG LBD (unknown origin) by Fluormone Pan-PPAR Green tracer based TR-FRET assay
In DepthDetails ArticlePubMed
TargetG-protein coupled receptor 84(Homo sapiens (Human))
University Of Bonn
Curated by ChEMBL
LigandPNGBDBM50239187(CHEBI:30813 | Decanoic Acid | Decanoic Acid Anion)
Affinity DataEC50:  4.50E+3nM. Assay description: Agonist activity at human N-terminal-FLAG-tagged human GPR84 expressed in CHO cells assessed as inhibition of forskolin-induced cAMP accumulation pre...
In DepthDetails ArticlePubMed
TargetG-protein coupled receptor 84(Homo sapiens (Human))
University Of Bonn
Curated by ChEMBL
LigandPNGBDBM50239187(CHEBI:30813 | Decanoic Acid | Decanoic Acid Anion)
Affinity DataEC50:  6.08E+3nM. Assay description: Agonist activity at human GPR84 expressed in CHO cells assessed as beta-arrestin recruitment after 90 mins by beta-galactosidase complementation assa...
In DepthDetails ArticlePubMed
TargetPeroxisome proliferator-activated receptor gamma(Homo sapiens (Human))
Chongqing Medical University
Curated by ChEMBL
LigandPNGBDBM50239187(CHEBI:30813 | Decanoic Acid | Decanoic Acid Anion)
Affinity DataIC50:  3.00E+4nM. Assay description: Displacement of [3H]BRL49653 from Homo sapiens (human) PPARgamma receptor by scintillation proximity assay
In DepthDetails Article
LigandPNGBDBM50239187(CHEBI:30813 | Decanoic Acid | Decanoic Acid Anion)
Affinity DataIC50:  3.00E+4nM. Assay description: Displacement of [3H]GW2331 from Homo sapiens (human) PPARalpha receptor by scintillation proximity assay
In DepthDetails Article
LigandPNGBDBM50239187(CHEBI:30813 | Decanoic Acid | Decanoic Acid Anion)
Affinity DataIC50:  3.00E+4nM. Assay description: Displacement of [3H]GW2433 from Homo sapiens (human) PPARdelta receptor by scintillation proximity assay
In DepthDetails Article
TargetG-protein coupled receptor 84(Homo sapiens (Human))
University Of Bonn
Curated by ChEMBL
LigandPNGBDBM50239187(CHEBI:30813 | Decanoic Acid | Decanoic Acid Anion)
Affinity DataEC50:  2.00E+4nM. Assay description: Agonist activity at recombinant human N-terminal epitope tagged/C-terminal eYFP-fused FLAG-tagged GPR84 expressed in Flp-In TREx 293 cell membranes a...
In DepthDetails ArticlePubMed
TargetG-protein coupled receptor 84(Homo sapiens (Human))
University Of Bonn
Curated by ChEMBL
LigandPNGBDBM50239187(CHEBI:30813 | Decanoic Acid | Decanoic Acid Anion)
Affinity DataEC50:  4.60E+3nM. Assay description: Agonist activity at human N-terminal FLAG-tagged GPR84 receptor stably expressed in CHO cells assessed as inhibition of forskolin-induced cAMP produc...
In DepthDetails ArticlePubMed
TargetG-protein coupled receptor 84(Homo sapiens (Human))
University Of Bonn
Curated by ChEMBL
LigandPNGBDBM50239187(CHEBI:30813 | Decanoic Acid | Decanoic Acid Anion)
Affinity DataEC50:  4.60E+3nM. Assay description: Agonist activity at human N-terminal FLAG-tagged GPR84 receptor stably expressed in CHO cell membranes assessed as stimulation of [35S]GTPgammaS bind...
In DepthDetails ArticlePubMed
TargetG-protein coupled receptor 84(Homo sapiens (Human))
University Of Bonn
Curated by ChEMBL
LigandPNGBDBM50239187(CHEBI:30813 | Decanoic Acid | Decanoic Acid Anion)
Affinity DataEC50:  2.50E+4nM. Assay description: Agonist activity at recombinant human N-terminal epitope tagged/C-terminal eYFP-fused FLAG-tagged GPR84 expressed in Flp-In TREx 293 cell membranes a...
In DepthDetails ArticlePubMed
TargetG-protein coupled receptor 84(Homo sapiens (Human))
University Of Bonn
Curated by ChEMBL
LigandPNGBDBM50239187(CHEBI:30813 | Decanoic Acid | Decanoic Acid Anion)
Affinity DataEC50:  1.00E+4nM. Assay description: Agonist activity at recombinant human GPR84 expressed in HEK293 cells assessed as beta-arrestin 2 recruitment by beta-galactosidase based PathHunter ...
In DepthDetails ArticlePubMed
TargetG-protein coupled receptor 84(Homo sapiens (Human))
University Of Bonn
Curated by ChEMBL
LigandPNGBDBM50239187(CHEBI:30813 | Decanoic Acid | Decanoic Acid Anion)
Affinity DataEC50:  4.80E+4nM. Assay description: Agonist activity at human Gi1alpha-coupled GPR84 expressed in baculovirus infected Sf9 insect cells assessed as stimulation of [35S]GTPgammaS binding...
In DepthDetails ArticlePubMed
TargetG-protein coupled receptor 84(Homo sapiens (Human))
University Of Bonn
Curated by ChEMBL
LigandPNGBDBM50239187(CHEBI:30813 | Decanoic Acid | Decanoic Acid Anion)
Affinity DataEC50:  3.00E+4nM. Assay description: Agonist activity at recombinant human N-terminally HA-tagged GPR84 expressed in CHO cells co-expressing Gqi5 assessed as inhibition of forskolin-indu...
In DepthDetails ArticlePubMed
TargetG-protein coupled receptor 84(Homo sapiens (Human))
University Of Bonn
Curated by ChEMBL
LigandPNGBDBM50239187(CHEBI:30813 | Decanoic Acid | Decanoic Acid Anion)
Affinity DataEC50:  4.80E+4nM. Assay description: Agonist activity at recombinant human GPR84 expressed in CHO cells co-expressing Galpha16/Gqs5/Gqo5/Gqi9 assessed as increase in calcium mobilization...
In DepthDetails ArticlePubMed
TargetPeroxisome proliferator-activated receptor gamma(Homo sapiens (Human))
Chongqing Medical University
Curated by ChEMBL
LigandPNGBDBM50239187(CHEBI:30813 | Decanoic Acid | Decanoic Acid Anion)
Affinity DataEC50:  7.60E+3nM. Assay description: Partial agonist activity at full length human PPARG expressed in African green monkey COS7 cells assessed as increase in receptor activation incubate...
In DepthDetails ArticlePubMed
LigandPNGBDBM50239187(CHEBI:30813 | Decanoic Acid | Decanoic Acid Anion)
Affinity DataEC50:  3.10E+4nM. Assay description: Agonist activity at human PPARalpha expressed in HEK293 cells by luciferase/beta-galactosidase reporter gene assay
In DepthDetails PubMed
TargetPeroxisome proliferator-activated receptor gamma(Homo sapiens (Human))
Chongqing Medical University
Curated by ChEMBL
LigandPNGBDBM50239187(CHEBI:30813 | Decanoic Acid | Decanoic Acid Anion)
Affinity DataEC50:  5.40E+4nM. Assay description: Agonist activity at human PPARgamma expressed in HEK293 cells by luciferase/beta-galactosidase reporter gene assay
In DepthDetails PubMed
TargetG-protein coupled receptor 84(Homo sapiens (Human))
University Of Bonn
Curated by ChEMBL
LigandPNGBDBM50239187(CHEBI:30813 | Decanoic Acid | Decanoic Acid Anion)
Affinity DataEC50:  7.42E+3nM. Assay description: Agonist activity at Gi coupled human GPR84 expressed in CHO cells assessed as inhibition of forskolin-induced cAMP accumulation after 15 mins in pres...
In DepthDetails ArticlePubMed
TargetG-protein coupled receptor 84(Homo sapiens (Human))
University Of Bonn
Curated by ChEMBL
LigandPNGBDBM50239187(CHEBI:30813 | Decanoic Acid | Decanoic Acid Anion)
Affinity DataEC50:  1.00E+4nM. Assay description: Agonist activity at human GPR84 assessed as beta-arrestin recruitment by beta-galactosidase complementation assay
In DepthDetails ArticlePubMed