BDBM50280260 7-{4-[3-(4-Chloro-benzenesulfonylamino)-propyl]-pyridin-3-yl}-heptanoic acid::CHEMBL297561
SMILES OC(=O)CCCCCCc1cnccc1CCCNS(=O)(=O)c1ccc(Cl)cc1
InChI Key InChIKey=UHRUKVZHDOYFTJ-UHFFFAOYSA-N
Data  1 IC50
  Tab Delimited (TSV)   2D SDfile   Computed 3D by Vconf -m prep SDfile
Find this compound or compounds like it in BindingDB:
Activity Spreadsheet -- Enzyme Inhibition Constant Data from BindingDB
Found 1 hit for monomerid = 50280260
TargetThromboxane-A synthase(Homo sapiens (Human))
TBA
Curated by ChEMBL
LigandPNGBDBM50280260(7-{4-[3-(4-Chloro-benzenesulfonylamino)-propyl]-py...)
Affinity DataIC50:  15nM. Assay description: Inhibitory concentration of the compound against thromboxane synthase enzyme
In DepthDetails Article