BDBM50280262 6-{4-[(4-Chloro-benzenesulfonylamino)-methyl]-pyridin-3-yl}-hexanoic acid::CHEMBL295049
SMILES OC(=O)CCCCCc1cnccc1CNS(=O)(=O)c1ccc(Cl)cc1
InChI Key InChIKey=CYCSGKXUCZQZOB-UHFFFAOYSA-N
Data  1 IC50
  Tab Delimited (TSV)   2D SDfile   Computed 3D by Vconf -m prep SDfile
Find this compound or compounds like it in BindingDB:
Activity Spreadsheet -- Enzyme Inhibition Constant Data from BindingDB
Found 1 hit for monomerid = 50280262
TargetThromboxane-A synthase(Homo sapiens (Human))
TBA
Curated by ChEMBL
LigandPNGBDBM50280262(6-{4-[(4-Chloro-benzenesulfonylamino)-methyl]-pyri...)
Affinity DataIC50:  66nM. Assay description: Inhibitory concentration of the compound against thromboxane synthase enzyme
In DepthDetails Article