BDBM50294738 CHEMBL551981::{3-[3-Benzyl-8-(trifluoromethyl)quinolin-4-yl]phenyl}-[(1-methyl-1H-indol-2-yl)methyl]amine
SMILES Cn1c(CNc2cccc(c2)-c2c(Cc3ccccc3)cnc3c(cccc23)C(F)(F)F)cc2ccccc12
InChI Key InChIKey=MJGWHEJLSWUCNL-UHFFFAOYSA-N
Data  2 IC50  2 EC50
  Tab Delimited (TSV)   2D SDfile   Computed 3D by Vconf -m prep SDfile
Find this compound or compounds like it in BindingDB:
Activity Spreadsheet -- Enzyme Inhibition Constant Data from BindingDB
Found 4 hits for monomerid = 50294738
TargetOxysterols receptor LXR-beta(Homo sapiens (Human))
Wyeth Research
Curated by ChEMBL
LigandPNGBDBM50294738(CHEMBL551981 | {3-[3-Benzyl-8-(trifluoromethyl)qui...)
Affinity DataIC50:  3.90E+4nM. Assay description: Displacement of [3H]T0901317 from human recombinant N-terminal biotinylated tagged LXRbeta ligand binding domain (154-461) expressed in Escherichia c...
In DepthDetails ArticlePubMed
TargetOxysterols receptor LXR-alpha(Homo sapiens (Human))
Wyeth Research
Curated by ChEMBL
LigandPNGBDBM50294738(CHEMBL551981 | {3-[3-Benzyl-8-(trifluoromethyl)qui...)
Affinity DataEC50:  1.35E+4nM. Assay description: Agonist activity at human LXRalpha ligand binding domain (205-448) expressed in human HuH7 cells cotransfected with Gal4-DBD by luciferase transactiv...
In DepthDetails ArticlePubMed
TargetOxysterols receptor LXR-beta(Homo sapiens (Human))
Wyeth Research
Curated by ChEMBL
LigandPNGBDBM50294738(CHEMBL551981 | {3-[3-Benzyl-8-(trifluoromethyl)qui...)
Affinity DataEC50:  1.02E+4nM. Assay description: Agonist activity at human LXRbeta ligand binding domain (219-462) expressed in human HuH7 cells cotransfected with Gal4-DBD by luciferase transactiva...
In DepthDetails ArticlePubMed
TargetOxysterols receptor LXR-alpha(Homo sapiens (Human))
Wyeth Research
Curated by ChEMBL
LigandPNGBDBM50294738(CHEMBL551981 | {3-[3-Benzyl-8-(trifluoromethyl)qui...)
Affinity DataIC50:  1.12E+6nM. Assay description: Displacement of [3H]T0901317 from human recombinant N-terminal biotinylated tagged LXRalpha ligand binding domain (197-447) expressed in Escherichia ...
In DepthDetails ArticlePubMed