BDBM50344475 2-(4-(2,4-dihydroindeno[1,2-c]pyrazol-6-yl)-3-(pyridin-4-yl)-1H-pyrazol-1-yl)-N-methylethanamine::CHEMBL1780172
SMILES CNCCn1cc(c(n1)-c1ccncc1)-c1ccc-2c(Cc3c[nH]nc-23)c1
InChI Key InChIKey=KGIWTSNDMWSYJW-UHFFFAOYSA-N
Data  2 IC50
  Tab Delimited (TSV)   2D SDfile   Computed 3D by Vconf -m prep SDfile
Find this compound or compounds like it in BindingDB:
Activity Spreadsheet -- Enzyme Inhibition Constant Data from BindingDB
Found 2 hits for monomerid = 50344475
TargetSerine/threonine-protein kinase B-raf(Homo sapiens (Human))
Array Biopharma
Curated by ChEMBL
LigandPNGBDBM50344475(2-(4-(2,4-dihydroindeno[1,2-c]pyrazol-6-yl)-3-(pyr...)
Affinity DataIC50:  8.16E+3nM. Assay description: Inhibition of B-Raf-mediated ERK phosphorylation in cell-based assay
In DepthDetails ArticlePubMed
TargetSerine/threonine-protein kinase B-raf(Homo sapiens (Human))
Array Biopharma
Curated by ChEMBL
LigandPNGBDBM50344475(2-(4-(2,4-dihydroindeno[1,2-c]pyrazol-6-yl)-3-(pyr...)
Affinity DataIC50:  72.5nM. Assay description: Inhibition of B-Raf
In DepthDetails ArticlePubMed