BDBM50424387 CHEMBL2315052
SMILES CCN(CC)C(=O)c1cccc(Cc2cc(Cl)ccc2OCc2ccc(Cl)cc2F)n1
InChI Key InChIKey=AWFBHJQNBWSWAR-UHFFFAOYSA-N
Data  1 Kd
  Tab Delimited (TSV)   2D SDfile   Computed 3D by Vconf -m prep SDfile
Find this compound or compounds like it in BindingDB:
Activity Spreadsheet -- Enzyme Inhibition Constant Data from BindingDB
Found 1 hit for monomerid = 50424387
TargetProstaglandin E2 receptor EP1 subtype(Mus musculus (Mouse))
Vanderbilt University School Of Medicine
Curated by ChEMBL
LigandPNGBDBM50424387(CHEMBL2315052)
Affinity DataKd:  447nM. Assay description: Antagonist activity at mouse EP1 receptor expressed in CHOK1 cells assessed as inhibition of 17PTPGE2-induced calcium influx
In DepthDetails ArticlePubMed