BDBM50433198 CHEMBL2375588
SMILES OC1CCC(Cc2ccc(OCCCN3CCCCC3)cc2)CC1
InChI Key InChIKey=HKFWOTJVDCMHST-UHFFFAOYSA-N
Data  1 KI
  Tab Delimited (TSV)   2D SDfile   Computed 3D by Vconf -m prep SDfile
Find this compound or compounds like it in BindingDB:
Activity Spreadsheet -- Enzyme Inhibition Constant Data from BindingDB
Found 1 hit for monomerid = 50433198
TargetHistamine H3 receptor(Mus musculus)
Bioprojet-Biotech
Curated by ChEMBL
LigandPNGBDBM50433198(CHEMBL2375588)
Affinity DataKi:  6.30nM. Assay description: Displacement of [125I]-iodoproxyfan from histamine H3 receptor in mouse brain cortex after 1 hr by gamma counting analysis
In DepthDetails ArticlePubMed