BDBM50436720 CHEMBL2401963
SMILES CC[C@H]1N(C2CCCC2)c2nc(ncc2N(C)C1=O)-n1ccnc1-c1ccccc1
InChI Key InChIKey=JMDRAMDTWLAOHD-GOSISDBHSA-N
Data  3 IC50
PDB links: 1 PDB ID matches this monomer.
  Tab Delimited (TSV)   2D SDfile   Computed 3D by Vconf -m prep SDfile
Find this compound or compounds like it in BindingDB:
Activity Spreadsheet -- Enzyme Inhibition Constant Data from BindingDB
Found 3 hits for monomerid = 50436720
TargetSerine/threonine-protein kinase PLK3(Homo sapiens (Human))
Elan Pharmaceuticals
Curated by ChEMBL
LigandPNGBDBM50436720(CHEMBL2401963)
Affinity DataIC50:  9.40E+4nM. Assay description: Inhibition of GST-tagged Plk3 (unknown origin) assessed as inhibition of DEKTDDED phosphorylation at Thr1342 after 15 mins by TR-FRET assay
In DepthDetails ArticlePubMed
TargetSerine/threonine-protein kinase PLK2(Homo sapiens (Human))
Elan Pharmaceuticals
Curated by ChEMBL
LigandPNGBDBM50436720(CHEMBL2401963)
Affinity DataIC50:  5nM. Assay description: Inhibition of GST-tagged Plk2 (unknown origin) assessed as inhibition of DEKTDDED phosphorylation at Thr1342 after 60 mins by TR-FRET assay
TargetSerine/threonine-protein kinase PLK1(Homo sapiens (Human))
Elan Pharmaceuticals
Curated by ChEMBL
LigandPNGBDBM50436720(CHEMBL2401963)
Affinity DataIC50:  8nM. Assay description: Inhibition of GST-tagged Plk1 (unknown origin) assessed as inhibition of DEKTDDED phosphorylation at Thr1342 after 60 mins by TR-FRET assay
In DepthDetails ArticlePubMed