BDBM50466651 CHEMBL4283251
SMILES OC(=O)Cc1ccc2oc(nc2c1)-c1ccc(NC(=O)Nc2ccc(cc2F)-c2nc3cc(CC(O)=O)ccc3o2)c(F)c1
InChI Key InChIKey=OQIIXTUVVHGQFF-UHFFFAOYSA-N
Data  1 IC50
  Tab Delimited (TSV)   2D SDfile   Computed 3D by Vconf -m prep SDfile
Find this compound or compounds like it in BindingDB:
Activity Spreadsheet -- Enzyme Inhibition Constant Data from BindingDB
Found 1 hit for monomerid = 50466651
TargetHeparanase(Homo sapiens (Human))
"Sapienza" Universit£
Curated by ChEMBL
LigandPNGBDBM50466651(CHEMBL4283251)
Affinity DataIC50:  180nM. Assay description: Inhibition of recombinant HPSE (unknown origin) using fondaparinux as substrate incubated for 3 hrs in absence of light by WST1 assay
Ligand InfoPC cidPC sid
In DepthDetails ArticlePubMed