BDBM50469888 CHEMBL104667
SMILES CCNC(=O)c1c(nc(CC)n1Cc1ccc2oc(c(Br)c2c1)-c1ccccc1NS(=O)(=O)C(F)(F)F)C1CC1
InChI Key InChIKey=WZQNDQZVFSLAEE-UHFFFAOYSA-N
Data  1 KI
  Tab Delimited (TSV)   2D SDfile   Computed 3D by Vconf -m prep SDfile
Find this compound or compounds like it in BindingDB:
Activity Spreadsheet -- Enzyme Inhibition Constant Data from BindingDB
Found 1 hit for monomerid = 50469888
LigandPNGBDBM50469888(CHEMBL104667)
Affinity DataKi:  0.631nM. Assay description: Tested for in vitro binding affinity against angiotensin II receptor of rat liver
Ligand InfoPC cidPC sid
In DepthDetails ArticlePubMed