BDBM50482379 CHEMBL1210963
SMILES COc1ccc(\C=C2\c3cccc(Cl)c3C(=O)c3cccc(Cl)c23)cc1
InChI Key InChIKey=LOTDAOZXGQTYSW-ATVHPVEESA-N
Data  1 IC50
  Tab Delimited (TSV)   2D SDfile   Computed 3D by Vconf -m prep SDfile
Find this compound or compounds like it in BindingDB:
Activity Spreadsheet -- Enzyme Inhibition Constant Data from BindingDB
Found 1 hit for monomerid = 50482379
TargetTubulin beta chain(Sus scrofa)
Westphalian Wilhelms-University
Curated by ChEMBL
LigandPNGBDBM50482379(CHEMBL1210963)
Affinity DataIC50:  520nM. Assay description: Inhibition of pig brain tubulin polymerization after 30 mins by turbidimetry
Ligand InfoPC cidPC sid
In DepthDetails ArticlePubMed