BDBM50490884 CHEMBL2347884
SMILES C(CCCNc1c2CCCCc2nc2ccccc12)CCCN1CCCCC1
InChI Key InChIKey=HDYPSXQANZTQMT-UHFFFAOYSA-N
Data  1 IC50
  Tab Delimited (TSV)   2D SDfile   Computed 3D by Vconf -m prep SDfile
Find this compound or compounds like it in BindingDB:
Activity Spreadsheet -- Enzyme Inhibition Constant Data from BindingDB
Found 1 hit for monomerid = 50490884
TargetAcetylcholinesterase(Rattus norvegicus (rat))
Complutense University Of Madrid
Curated by ChEMBL
LigandPNGBDBM50490884(CHEMBL2347884)
Affinity DataIC50:  20nM. Assay description: Inhibition of rat brain acetylcholinesterase
Ligand InfoPC cidPC sid
In DepthDetails ArticlePubMed