BDBM50502449 CHEMBL4474988
SMILES N[C@@H](CCN(C[C@H]1O[C@H]([C@H](O)[C@@H]1O)n1cnc2c(N)ncnc12)Cc1cccc(c1)C(O)=O)C(O)=O
InChI Key InChIKey=SOTZFJHFBFHOMD-SWQDORGXSA-N
Data  1 IC50  1 Kd
  Tab Delimited (TSV)   2D SDfile   Computed 3D by Vconf -m prep SDfile
Find this compound or compounds like it in BindingDB:
Activity Spreadsheet -- Enzyme Inhibition Constant Data from BindingDB
Found 2 hits for monomerid = 50502449
TargetNicotinamide N-methyltransferase(Homo sapiens (Human))
Leiden University
Curated by ChEMBL
LigandPNGBDBM50502449(CHEMBL4474988)
Affinity DataKd:  1.24E+5nM. Assay description: Binding affinity to wild-type human full length NNMT expressed in Escherichia coli BL21(DE3)-codonplus-RIL cells by isothermal titration calorimetry
Ligand InfoPC cidPC sid
In DepthDetails ArticlePubMed
TargetNicotinamide N-methyltransferase(Homo sapiens (Human))
Leiden University
Curated by ChEMBL
LigandPNGBDBM50502449(CHEMBL4474988)
Affinity DataIC50:  2.34E+4nM. Assay description: Inhibition of wild-type human full length NNMT expressed in Escherichia coli BL21(DE3) cells assessed as reduction in 1-methyl-nicotinamide formation...
Ligand InfoPC cidPC sid
In DepthDetails ArticlePubMed