BDBM50505941 CHEMBL4451125
SMILES CC(C)n1cnnc1-c1cccc(NC(=O)c2ccccc2F)n1
InChI Key InChIKey=IUQZTKCWPJKKDY-UHFFFAOYSA-N
Data  3 IC50
  Tab Delimited (TSV)   2D SDfile   Computed 3D by Vconf -m prep SDfile
Find this compound or compounds like it in BindingDB:
Activity Spreadsheet -- Enzyme Inhibition Constant Data from BindingDB
Found 3 hits for monomerid = 50505941
TargetMitogen-activated protein kinase kinase kinase 5(Homo sapiens (Human))
TBA
Curated by ChEMBL
LigandPNGBDBM50505941(CHEMBL4451125)
Affinity DataIC50:  76nM. Assay description: Inhibition of human ASK1 using myelin basic protein substrate pre-incubated for 20 mins before [33P]-ATP addition and measured after 2 hrs by filter-...
Ligand InfoPC cidPC sid
In DepthDetails ArticlePubMed
TargetMitogen-activated protein kinase kinase kinase 5(Homo sapiens (Human))
TBA
Curated by ChEMBL
LigandPNGBDBM50505941(CHEMBL4451125)
Affinity DataIC50:  100nM. Assay description: Inhibition of ASK1 (unknown origin)
Ligand InfoPC cidPC sid
In DepthDetails ArticlePubMed
TargetMitogen-activated protein kinase kinase kinase 5(Homo sapiens (Human))
TBA
Curated by ChEMBL
LigandPNGBDBM50505941(CHEMBL4451125)
Affinity DataIC50:  8.16E+3nM. Assay description: Inhibition of V5 tagged human ASK1 expressed in HEK-293T cells assessed as reduction in T838 autophosphorylation incubated for 1 hr
Ligand InfoPC cidPC sid
In DepthDetails ArticlePubMed