BDBM50518981 CHEMBL4594173
SMILES CC(C)NC[C@H](O)COc1ccccc1CCCC(=O)NCCNC(=O)CCCc1ccccc1OC[C@@H](O)CNC(C)C
InChI Key InChIKey=DVVZHJCUNXOYDW-KYJUHHDHSA-N
Data  2 KI  3 IC50  1 Kd
  Tab Delimited (TSV)   2D SDfile   Computed 3D by Vconf -m prep SDfile
Find this compound or compounds like it in BindingDB:
Activity Spreadsheet -- Enzyme Inhibition Constant Data from BindingDB
Found 6 hits for monomerid = 50518981
TargetBeta-2 adrenergic receptor(Homo sapiens (Human))
University Of Copenhagen
Curated by ChEMBL
LigandPNGBDBM50518981(CHEMBL4594173)
Affinity DataKi:  0.759nM. Assay description: Displacement of [3H]DHA from beta2 adrenergic receptor (unknown origin) stably expressed in HEK293 cell membranes measured after 90 mins by scintilla...
Ligand InfoPC cidPC sid
In DepthDetails ArticlePubMed
TargetBeta-1 adrenergic receptor(Homo sapiens (Human))
University Of Copenhagen
Curated by ChEMBL
LigandPNGBDBM50518981(CHEMBL4594173)
Affinity DataKi:  8.90nM. Assay description: Displacement of [3H]DHA from beta1 adrenergic receptor (unknown origin) stably expressed in HEK293 cell membranes measured after 90 mins by scintilla...
Ligand InfoPC cidPC sid
In DepthDetails ArticlePubMed
TargetBeta-2 adrenergic receptor(Homo sapiens (Human))
University Of Copenhagen
Curated by ChEMBL
LigandPNGBDBM50518981(CHEMBL4594173)
Affinity DataKd:  1.30nM. Assay description: Displacement of [3H]DHA from beta2 adrenergic receptor (unknown origin) stably expressed in HEK293 cell membranes measured after 90 mins by scintilla...
Ligand InfoPC cidPC sid
In DepthDetails ArticlePubMed
TargetBeta-2 adrenergic receptor(Homo sapiens (Human))
University Of Copenhagen
Curated by ChEMBL
LigandPNGBDBM50518981(CHEMBL4594173)
Affinity DataIC50:  1.5nM. Assay description: Antagonist activity at beta2 adrenergic receptor (unknown origin) expressed in HEK293 cell assessed as inhibition of isoproterenol-induced cAMP produ...
Ligand InfoPC cidPC sid
In DepthDetails ArticlePubMed
TargetBeta-1 adrenergic receptor(Homo sapiens (Human))
University Of Copenhagen
Curated by ChEMBL
LigandPNGBDBM50518981(CHEMBL4594173)
Affinity DataIC50:  26nM. Assay description: Antagonist activity at beta1 adrenergic receptor (unknown origin) stably expressed in HEK293 cell membranes assessed as inhibition of isoproterenol-i...
Ligand InfoPC cidPC sid
In DepthDetails ArticlePubMed
TargetBeta-2 adrenergic receptor(Homo sapiens (Human))
University Of Copenhagen
Curated by ChEMBL
LigandPNGBDBM50518981(CHEMBL4594173)
Affinity DataIC50:  6.60nM. Assay description: Antagonist activity at beta2 adrenergic receptor (unknown origin) stably expressed in HEK293 cell membranes assessed as inhibition of isoproterenol-i...
Ligand InfoPC cidPC sid
In DepthDetails ArticlePubMed