BDBM50558665 CHEMBL4776666
SMILES [H][C@@]12COP(O)(=O)O[C@@]3([H])[C@@H](O)[C@@H](O[C@]3([H])COP(O)(=O)O[C@@]1([H])[C@@H](O)[C@@H](O2)n1cnc2c(N)ncnc12)n1cnc2c(O)ncnc12
InChI Key InChIKey=SBNULQXUGGEMOY-XPWFQUROSA-N
Data  3 IC50  13 EC50
  Tab Delimited (TSV)   2D SDfile   Computed 3D by Vconf -m prep SDfile
Find this compound or compounds like it in BindingDB:
Activity Spreadsheet -- Enzyme Inhibition Constant Data from BindingDB
Found 16 hits for monomerid = 50558665
TargetStimulator of interferon genes protein(Mus musculus)
Invivogen
Curated by ChEMBL
LigandPNGBDBM50558665(CHEMBL4776666)
Affinity DataEC50:  8.40E+3nM. Assay description: Activation of STING in mouse RAW-Lucia ISG cells assessed as induction of type I IFNs stimulation by measuring induction of IRF pathway incubated for...
Ligand InfoPC cidPC sid
In DepthDetails ArticlePubMed
TargetStimulator of interferon genes protein(Mus musculus)
Invivogen
Curated by ChEMBL
LigandPNGBDBM50558665(CHEMBL4776666)
Affinity DataEC50:  180nM. Assay description: Binding affinity to wild type mouse His-tagged STING cytoplasmic domain (155 to 341 residues) assessed as induction of protein dimerization incubated...
Ligand InfoPC cidPC sid
In DepthDetails ArticlePubMed
TargetStimulator of interferon genes protein(Human)
Invivogen
Curated by ChEMBL
LigandPNGBDBM50558665(CHEMBL4776666)
Affinity DataEC50:  1.59E+4nM. Assay description: Activation of STING in human THP-1-Dual cells assessed as induction of type I IFNs by measuring stimulation of NF-kappaB pathway incubated for 48 hrs...
Ligand InfoPC cidPC sid
In DepthDetails ArticlePubMed
TargetStimulator of interferon genes protein(Human)
Invivogen
Curated by ChEMBL
LigandPNGBDBM50558665(CHEMBL4776666)
Affinity DataEC50:  6.40E+3nM. Assay description: Activation of STING in human blood assessed as induction of type I IFNs incubated for 18 to 20 hrs by QUANTI-Blue assay
Ligand InfoPC cidPC sid
In DepthDetails ArticlePubMed
TargetStimulator of interferon genes protein(Human)
Invivogen
Curated by ChEMBL
LigandPNGBDBM50558665(CHEMBL4776666)
Affinity DataEC50:  3.70E+4nM. Assay description: Agonist activity at STING in human THP1 Dual cells assessed as IRF reporter activation incubated for 20 hrs by quanti-blue SEAP reporter gene assay
Ligand InfoPC cidPC sid
In DepthDetails ArticlePubMed
TargetStimulator of interferon genes protein(Mus musculus)
Invivogen
Curated by ChEMBL
LigandPNGBDBM50558665(CHEMBL4776666)
Affinity DataEC50:  7.50E+3nM. Assay description: Agonist activity at STING in mouse RAW-Lucia ISG cells assessed as IRF reporter activation incubated for 20 hrs by quanti-blue SEAP reporter gene ass...
Ligand InfoPC cidPC sid
In DepthDetails ArticlePubMed
TargetStimulator of interferon genes protein(Human)
Invivogen
Curated by ChEMBL
LigandPNGBDBM50558665(CHEMBL4776666)
Affinity DataEC50: >1.00E+5nM. Assay description: Agonist activity at STING in human THP1 Dual KO-STING cells assessed as IRF reporter activation incubated for 20 hrs by quanti-blue SEAP reporter gen...
Ligand InfoPC cidPC sid
In DepthDetails ArticlePubMed
TargetStimulator of interferon genes protein(Mus musculus)
Invivogen
Curated by ChEMBL
LigandPNGBDBM50558665(CHEMBL4776666)
Affinity DataEC50: >1.00E+5nM. Assay description: Agonist activity at STING in mouse RAW-Lucia ISG-KO-STING cells assessed as IRF reporter activation incubated for 20 hrs by quanti-blue SEAP reporter...
Ligand InfoPC cidPC sid
In DepthDetails ArticlePubMed
TargetStimulator of interferon genes protein(Human)
Invivogen
Curated by ChEMBL
LigandPNGBDBM50558665(CHEMBL4776666)
Affinity DataEC50:  6.00E+4nM. Assay description: Agonist activity at STING in human THP1-Dual cells assessed as NF-kappaB reporter activation incubated for 20 hrs by quanti-blue SEAP reporter gene a...
Ligand InfoPC cidPC sid
In DepthDetails ArticlePubMed
TargetStimulator of interferon genes protein(Human)
Invivogen
Curated by ChEMBL
LigandPNGBDBM50558665(CHEMBL4776666)
Affinity DataEC50: >1.00E+5nM. Assay description: Agonist activity at STING in human THP1-Dual KO-STING cells assessed as NF-kappaB reporter activation incubated for 20 hrs by quanti-blue SEAP report...
Ligand InfoPC cidPC sid
In DepthDetails ArticlePubMed
TargetStimulator of interferon genes protein(Human)
Invivogen
Curated by ChEMBL
LigandPNGBDBM50558665(CHEMBL4776666)
Affinity DataIC50:  200nM. Assay description: Displacement of fluorescein-labelled probe from wild type human His-tagged STING cytoplasmic domain (155 to 341 residues) by time-resolved FRET-based...
Ligand InfoPC cidPC sid
In DepthDetails ArticlePubMed
TargetStimulator of interferon genes protein(Mus musculus)
Invivogen
Curated by ChEMBL
LigandPNGBDBM50558665(CHEMBL4776666)
Affinity DataIC50:  7.70nM. Assay description: Displacement of fluorescein-labelled probe from wild type mouse His-tagged STING cytoplasmic domain (155 to 341 residues) by time-resolved FRET-based...
Ligand InfoPC cidPC sid
In DepthDetails ArticlePubMed
TargetStimulator of interferon genes protein(Human)
Invivogen
Curated by ChEMBL
LigandPNGBDBM50558665(CHEMBL4776666)
Affinity DataIC50:  7.20nM. Assay description: Displacement of fluorescein-labelled probe from human cytoplasmic domain of STING G230A/R293Q double mutant (155 to 341 residues) by time-resolved FR...
Ligand InfoPC cidPC sid
In DepthDetails ArticlePubMed
TargetStimulator of interferon genes protein(Human)
Invivogen
Curated by ChEMBL
LigandPNGBDBM50558665(CHEMBL4776666)
Affinity DataEC50:  6.80E+3nM. Assay description: Binding affinity to wild type human His-tagged STING cytoplasmic domain (155 to 341 residues) assessed as induction of protein dimerization incubated...
Ligand InfoPC cidPC sid
In DepthDetails ArticlePubMed
TargetStimulator of interferon genes protein(Human)
Invivogen
Curated by ChEMBL
LigandPNGBDBM50558665(CHEMBL4776666)
Affinity DataEC50:  62nM. Assay description: Binding affinity to human STING G230A/R293Q double mutant cytoplasmic domain (155 to 341 residues) assessed as induction of protein dimerization incu...
Ligand InfoPC cidPC sid
In DepthDetails ArticlePubMed
TargetStimulator of interferon genes protein(Human)
Invivogen
Curated by ChEMBL
LigandPNGBDBM50558665(CHEMBL4776666)
Affinity DataEC50:  5.10E+3nM. Assay description: Activation of STING in human THP-1-Dual cells assessed as induction of type I IFNs by measuring stimulation of IRF pathway incubated for 48 hrs by lu...
Ligand InfoPC cidPC sid
In DepthDetails ArticlePubMed