BDBM50847 6-(3-hydroxypropyl)-2,3-dihydro-[1,4]dithiino[2,3-c]pyrrole-5,7-dione::6-(3-hydroxypropyl)-2,3-dihydro-[1,4]dithiino[2,3-c]pyrrole-5,7-quinone::6-(3-oxidanylpropyl)-2,3-dihydro-[1,4]dithiino[2,3-c]pyrrole-5,7-dione::MLS000106102::SMR000103072::cid_2227556
SMILES OCCCN1C(=O)C2=C(SCCS2)C1=O
InChI Key InChIKey=MNGFJSCJWNJLBK-UHFFFAOYSA-N
Data  7 IC50  1 EC50
  Tab Delimited (TSV)   2D SDfile   Computed 3D by Vconf -m prep SDfile
Find this compound or compounds like it in BindingDB:
Activity Spreadsheet -- Enzyme Inhibition Constant Data from BindingDB
Found 8 hits for monomerid = 50847
TargetGlycoprotein 42(Human herpesvirus 4 type 2)
Emory University
Curated by PubChem BioAssay
LigandPNGBDBM50847(6-(3-hydroxypropyl)-2,3-dihydro-[1,4]dithiino[2,3-...)
Affinity DataIC50:  1.03E+4nM. Assay description: NIH Molecular Libraries Screening Centers Network [MLSCN] Emory Chemical Biology Discovery Center in MLSCN Assay provider: Theodore Jardetzky; Northw...
In DepthDetails PCBioAssay
TargetNeutrophil cytosol factor 1 [S99G](Homo sapiens (Human))
Emory University
Curated by PubChem BioAssay
LigandPNGBDBM50847(6-(3-hydroxypropyl)-2,3-dihydro-[1,4]dithiino[2,3-...)
Affinity DataIC50:  2.67E+4nM. Assay description: NIH Molecular Libraries Screening Centers Network [MLSCN] Emory Chemical Biology Discovery Center in MLSCN Assay provider: Susan Smith, Emory Univers...
In DepthDetails PCBioAssay
TargetProtein Rev(Human immunodeficiency virus 1)
The Scripps Research Institute Molecular Screening Center
Curated by PubChem BioAssay
LigandPNGBDBM50847(6-(3-hydroxypropyl)-2,3-dihydro-[1,4]dithiino[2,3-...)
Affinity DataIC50: >7.54E+4nM. Assay description: Source (MLPCN Center Name): The Scripps Research Institute Molecular Screening Center (SRIMSC) Affiliation: The Scripps Research Institute, TSRI Assa...
In DepthDetails PCBioAssay
TargetSentrin-specific protease 1(Homo sapiens (Human))
Burnham Center For Chemical Genomics
Curated by PubChem BioAssay
LigandPNGBDBM50847(6-(3-hydroxypropyl)-2,3-dihydro-[1,4]dithiino[2,3-...)
Affinity DataIC50:  2.05E+4nM
In DepthDetails PCBioAssay
TargetPolyadenylate-binding protein 1(Homo sapiens (Human))
Burnham Center For Chemical Genomics
Curated by PubChem BioAssay
LigandPNGBDBM50847(6-(3-hydroxypropyl)-2,3-dihydro-[1,4]dithiino[2,3-...)
Affinity DataIC50: >6.60E+4nM. Assay description: Data Source: Sanford-Burnham Center for Chemical Genomics (SBCCG) Source Affiliation: Sanford-Burnham Medical Research Institute (SBMRI, San Diego, C...
In DepthDetails PCBioAssay
TargetCorticotropin-releasing factor-binding protein(Homo sapiens (Human))
Burnham Center For Chemical Genomics
Curated by PubChem BioAssay
LigandPNGBDBM50847(6-(3-hydroxypropyl)-2,3-dihydro-[1,4]dithiino[2,3-...)
Affinity DataEC50: >5.30E+4nM. Assay description: Data Source: Sanford-Burnham Center for Chemical Genomics (SBCCG) Source Affiliation: Sanford-Burnham Medical Research Institute (SBMRI, San Diego, C...
In DepthDetails PCBioAssay
TargetSentrin-specific protease 1(Homo sapiens (Human))
Burnham Center For Chemical Genomics
Curated by PubChem BioAssay
LigandPNGBDBM50847(6-(3-hydroxypropyl)-2,3-dihydro-[1,4]dithiino[2,3-...)
Affinity DataIC50:  3.52E+4nM
In DepthDetails PCBioAssay
TargetFemale germline-specific tumor suppressor gld-1(Caenorhabditis elegans)
The Scripps Research Institute Molecular Screening Center
Curated by PubChem BioAssay
LigandPNGBDBM50847(6-(3-hydroxypropyl)-2,3-dihydro-[1,4]dithiino[2,3-...)
Affinity DataIC50:  4.07E+3nM. Assay description: Source (MLPCN Center Name): The Scripps Research Institute Molecular Screening Center (SRIMSC) Affiliation: The Scripps Research Institute, TSRI Assa...
In DepthDetails PCBioAssay