BDBM51257 ISORESERPILINE, CITRATE::MLS000736796::SMR000528329::cid_234845
SMILES OC(=O)CC(O)(CC(O)=O)C(O)=O.COC(=O)C1=COC(C)C2CN3CCc4c([nH]c5cc(OC)c(OC)cc45)C3CC12
InChI Key InChIKey=PEXDQBIIYNZYBT-UHFFFAOYSA-N
Data  1 IC50  2 EC50
  Tab Delimited (TSV)   2D SDfile   Computed 3D by Vconf -m prep SDfile
Find this compound or compounds like it in BindingDB:
Activity Spreadsheet -- Enzyme Inhibition Constant Data from BindingDB
Found 1 hit for monomerid = 51257
TargetZinc finger protein mex-5(Caenorhabditis elegans)
Broad Institute
Curated by PubChem BioAssay
LigandPNGBDBM51257(ISORESERPILINE, CITRATE | MLS000736796 | SMR000528...)
Affinity DataEC50:  1.44E+4nM. Assay description: Broad Institute: MLPCN maternal gene expression Project ID: 2024 Keywords: Zinc finger, C. elegans, maternal gene expression, RNA-protein interac...
In DepthDetails PCBioAssay