BDBM543701 US11279703, TABLE 6.290
SMILES CNCCNC(=O)Cc1ccc(Nc2ncc3ccn(-c4cccc(NS(=O)(=O)C(C)(C)C)c4)c3n2)cc1
InChI Key InChIKey=IHOWNNYVAUSWOU-UHFFFAOYSA-N
Data  8 IC50
  Tab Delimited (TSV)   2D SDfile   Computed 3D by Vconf -m prep SDfile
Find this compound or compounds like it in BindingDB:
Activity Spreadsheet -- Enzyme Inhibition Constant Data from BindingDB
Found 8 hits for monomerid = 543701
TargetBromodomain-containing protein 4 [75-147](Homo sapiens (Human))
Aptose Biosciences
US Patent
LigandPNGBDBM543701(US11279703, TABLE 6.290)
Affinity DataIC50:  205nM. Assay description: 1. Add 20 μl of the diluted compound to each well of the 384-well opti plate2. Tap the plate gently3. Add 10 μl of the enzyme to each well ...
Ligand InfoPC cidPC sid
In DepthDetails US Patent
TargetTyrosine-protein kinase JAK2(Homo sapiens (Human))
Aptose Biosciences
US Patent
LigandPNGBDBM543701(US11279703, TABLE 6.290)
Affinity DataIC50:  50nM. Assay description: 1. Add 20 μl of the diluted compound to each well of the 384-well opti plate2. Tap the plate gently3. Add 10 μl of the enzyme to each well ...
Ligand InfoPC cidPC sid
In DepthDetails US Patent
TargetBromodomain-containing protein 4 [342-460](Homo sapiens (Human))
Aptose Biosciences
US Patent
LigandPNGBDBM543701(US11279703, TABLE 6.290)
Affinity DataIC50:  67nM. Assay description: 1. Add 20 μl of the diluted compound to each well of the 384-well opti plate2. Tap the plate gently3. Add 10 μl of the enzyme to each well ...
Ligand InfoPC cidPC sid
In DepthDetails US Patent
TargetTyrosine-protein kinase JAK3(Homo sapiens (Human))
Aptose Biosciences
US Patent
LigandPNGBDBM543701(US11279703, TABLE 6.290)
Affinity DataIC50:  253nM. Assay description: 1. Add 20 μl of the diluted compound to each well of the 384-well opti plate2. Tap the plate gently3. Add 10 μl of the enzyme to each well ...
Ligand InfoPC cidPC sid
In DepthDetails US Patent
TargetBromodomain-containing protein 3 [51-123](Homo sapiens (Human))
Aptose Biosciences
US Patent
LigandPNGBDBM543701(US11279703, TABLE 6.290)
Affinity DataIC50:  117nM. Assay description: 1. Add 20 μl of the diluted compound to each well of the 384-well opti plate2. Tap the plate gently3. Add 10 μl of the enzyme to each well ...
Ligand InfoPC cidPC sid
In DepthDetails US Patent
TargetBromodomain testis-specific protein [22-138](Homo sapiens (Human))
Aptose Biosciences
US Patent
LigandPNGBDBM543701(US11279703, TABLE 6.290)
Affinity DataIC50:  268nM. Assay description: 1. Add 20 μl of the diluted compound to each well of the 384-well opti plate2. Tap the plate gently3. Add 10 μl of the enzyme to each well ...
Ligand InfoPC cidPC sid
In DepthDetails US Patent
TargetTyrosine-protein kinase JAK1(Homo sapiens (Human))
Aptose Biosciences
US Patent
LigandPNGBDBM543701(US11279703, TABLE 6.290)
Affinity DataIC50:  178nM. Assay description: 1. Add 20 μl of the diluted compound to each well of the 384-well opti plate2. Tap the plate gently3. Add 10 μl of the enzyme to each well ...
Ligand InfoPC cidPC sid
In DepthDetails US Patent
TargetBromodomain-containing protein 2 [91-163](Homo sapiens (Human))
Aptose Biosciences
US Patent
LigandPNGBDBM543701(US11279703, TABLE 6.290)
Affinity DataIC50:  576nM. Assay description: 1. Add 20 μl of the diluted compound to each well of the 384-well opti plate2. Tap the plate gently3. Add 10 μl of the enzyme to each well ...
Ligand InfoPC cidPC sid
In DepthDetails US Patent