BDBM543791 US11279703, TABLE 6.381::US11279703, TABLE 6.382
SMILES CNC1CCN(CC1)c1ccc(Nc2ncc3scc(-c4ccc(F)c(NS(=O)(=O)C(C)(C)C)c4)c3n2)cc1F
InChI Key InChIKey=CWPXISWQJSGGKR-UHFFFAOYSA-N
Data  10 IC50
  Tab Delimited (TSV)   2D SDfile   Computed 3D by Vconf -m prep SDfile
Find this compound or compounds like it in BindingDB:
Activity Spreadsheet -- Enzyme Inhibition Constant Data from BindingDB
Found 10 hits for monomerid = 543791
TargetBromodomain-containing protein 4 [75-147](Homo sapiens (Human))
Aptose Biosciences
US Patent
LigandPNGBDBM543791(US11279703, TABLE 6.381 | US11279703, TABLE 6.382)
Affinity DataIC50:  192nM. Assay description: 1. Add 20 μl of the diluted compound to each well of the 384-well opti plate2. Tap the plate gently3. Add 10 μl of the enzyme to each well ...
Ligand InfoPC cidPC sid
In DepthDetails US Patent
TargetTyrosine-protein kinase JAK2(Homo sapiens (Human))
Aptose Biosciences
US Patent
LigandPNGBDBM543791(US11279703, TABLE 6.381 | US11279703, TABLE 6.382)
Affinity DataIC50:  10nM. Assay description: 1. Add 20 μl of the diluted compound to each well of the 384-well opti plate2. Tap the plate gently3. Add 10 μl of the enzyme to each well ...
Ligand InfoPC cidPC sid
In DepthDetails US Patent
TargetBromodomain-containing protein 4 [342-460](Homo sapiens (Human))
Aptose Biosciences
US Patent
LigandPNGBDBM543791(US11279703, TABLE 6.381 | US11279703, TABLE 6.382)
Affinity DataIC50:  92nM. Assay description: 1. Add 20 μl of the diluted compound to each well of the 384-well opti plate2. Tap the plate gently3. Add 10 μl of the enzyme to each well ...
Ligand InfoPC cidPC sid
In DepthDetails US Patent
TargetBromodomain-containing protein 2 [91-163](Homo sapiens (Human))
Aptose Biosciences
US Patent
LigandPNGBDBM543791(US11279703, TABLE 6.381 | US11279703, TABLE 6.382)
Affinity DataIC50:  670nM. Assay description: 1. Add 20 μl of the diluted compound to each well of the 384-well opti plate2. Tap the plate gently3. Add 10 μl of the enzyme to each well ...
Ligand InfoPC cidPC sid
In DepthDetails US Patent
TargetTyrosine-protein kinase JAK2(Homo sapiens (Human))
Aptose Biosciences
US Patent
LigandPNGBDBM543791(US11279703, TABLE 6.381 | US11279703, TABLE 6.382)
Affinity DataIC50:  21nM. Assay description: 1. Add 20 μl of the diluted compound to each well of the 384-well opti plate2. Tap the plate gently3. Add 10 μl of the enzyme to each well ...
Ligand InfoPC cidPC sid
In DepthDetails US Patent
TargetBromodomain testis-specific protein [22-138](Homo sapiens (Human))
Aptose Biosciences
US Patent
LigandPNGBDBM543791(US11279703, TABLE 6.381 | US11279703, TABLE 6.382)
Affinity DataIC50:  223nM. Assay description: 1. Add 20 μl of the diluted compound to each well of the 384-well opti plate2. Tap the plate gently3. Add 10 μl of the enzyme to each well ...
Ligand InfoPC cidPC sid
In DepthDetails US Patent
TargetTyrosine-protein kinase JAK1(Homo sapiens (Human))
Aptose Biosciences
US Patent
LigandPNGBDBM543791(US11279703, TABLE 6.381 | US11279703, TABLE 6.382)
Affinity DataIC50:  1.20E+3nM. Assay description: 1. Add 20 μl of the diluted compound to each well of the 384-well opti plate2. Tap the plate gently3. Add 10 μl of the enzyme to each well ...
Ligand InfoPC cidPC sid
In DepthDetails US Patent
TargetTyrosine-protein kinase JAK3(Homo sapiens (Human))
Aptose Biosciences
US Patent
LigandPNGBDBM543791(US11279703, TABLE 6.381 | US11279703, TABLE 6.382)
Affinity DataIC50:  82nM. Assay description: 1. Add 20 μl of the diluted compound to each well of the 384-well opti plate2. Tap the plate gently3. Add 10 μl of the enzyme to each well ...
Ligand InfoPC cidPC sid
In DepthDetails US Patent
TargetBromodomain-containing protein 4 [75-147](Homo sapiens (Human))
Aptose Biosciences
US Patent
LigandPNGBDBM543791(US11279703, TABLE 6.381 | US11279703, TABLE 6.382)
Affinity DataIC50:  308nM. Assay description: 1. Add 20 μl of the diluted compound to each well of the 384-well opti plate2. Tap the plate gently3. Add 10 μl of the enzyme to each well ...
Ligand InfoPC cidPC sid
In DepthDetails US Patent
TargetBromodomain-containing protein 3 [51-123](Homo sapiens (Human))
Aptose Biosciences
US Patent
LigandPNGBDBM543791(US11279703, TABLE 6.381 | US11279703, TABLE 6.382)
Affinity DataIC50:  154nM. Assay description: 1. Add 20 μl of the diluted compound to each well of the 384-well opti plate2. Tap the plate gently3. Add 10 μl of the enzyme to each well ...
Ligand InfoPC cidPC sid
In DepthDetails US Patent