BDBM548116 WO2022091056, Example 107
SMILES Cc1c(c(Cl)cc[n+]1[O-])-c1ccc(NC(=O)[C@@H](NC(=O)c2ccnn2C)C2CCC(F)(F)CC2)cc1F
InChI Key InChIKey=DKSWTUWSIMUFNT-QFIPXVFZSA-N
Data  1 IC50
  Tab Delimited (TSV)   2D SDfile   Computed 3D by Vconf -m prep SDfile
Find this compound or compounds like it in BindingDB:
Activity Spreadsheet -- Enzyme Inhibition Constant Data from BindingDB
Found 1 hit for monomerid = 548116
TargetInterleukin-17 receptor A/(Homo sapiens (Human))
Novartis
WIPO
LigandPNGBDBM548116(WO2022091056, Example 107)
Affinity DataIC50:  19nM. Assay description:  Dilutions of test compounds in DMSO are plated onto white low-volume 384-well plates (Greiner, #784075). Specifically, solutions of graded concentra...
Ligand InfoPC cidPC sid
In DepthDetails PubMed