BDBM55308 8-quinolinecarboxylic acid phenyl ester::MLS000099891::SMR000081003::cid_2227226::phenyl 8-quinolinecarboxylate::phenyl quinoline-8-carboxylate::quinoline-8-carboxylic acid phenyl ester
SMILES O=C(Oc1ccccc1)c1cccc2cccnc12
InChI Key InChIKey=GPMDYHKFDVDMLK-UHFFFAOYSA-N
Data  1 IC50
  Tab Delimited (TSV)   2D SDfile   Computed 3D by Vconf -m prep SDfile
Find this compound or compounds like it in BindingDB:
Activity Spreadsheet -- Enzyme Inhibition Constant Data from BindingDB
Found 1 hit for monomerid = 55308
TargetNeutrophil cytosol factor 1 [S99G](Homo sapiens (Human))
Emory University
Curated by PubChem BioAssay
LigandPNGBDBM55308(8-quinolinecarboxylic acid phenyl ester | MLS00009...)
Affinity DataIC50:  5.00E+4nM. Assay description: NIH Molecular Libraries Screening Centers Network [MLSCN] Emory Chemical Biology Discovery Center in MLSCN Assay provider: Susan Smith, Emory Univers...
In DepthDetails PCBioAssay