BDBM628475 US20230339856, Compound (IIf)
SMILES OC[C@@]12CCCCN1C[C@H](O)[C@@H](O)[C@@H]2O
InChI Key InChIKey=SCZMFTGAUWJUSB-QCLAVDOMSA-N
Data  2 IC50
  Tab Delimited (TSV)   2D SDfile   Computed 3D by Vconf -m prep SDfile
Find this compound or compounds like it in BindingDB:
Activity Spreadsheet -- Enzyme Inhibition Constant Data from BindingDB
Found 2 hits for monomerid = 628475
TargetLysosomal alpha-glucosidase(Homo sapiens (Human))
UniversitÉ
US Patent
LigandPNGBDBM628475(US20230339856, Compound (IIf))
Affinity DataIC50:  2.97E+5nM. Assay description: The inhibiting activity on recombinant human acid α-glucosidase (rhGAA) of the compounds is implemented using the Fluopol-ABPP method (Fluoresce...
Ligand InfoPC cidPC sid
In DepthDetails US Patent
TargetLysosomal alpha-glucosidase(Homo sapiens (Human))
UniversitÉ
US Patent
LigandPNGBDBM628475(US20230339856, Compound (IIf))
Affinity DataIC50:  870nM. Assay description: The rhGAA enzyme sold under the name Myozyme® used comes from residues of perfusions of the recombinant enzyme used for treating, by enzyme therapy, ...
Ligand InfoPC cidPC sid
In DepthDetails US Patent