BDBM67749 MLS000056716::N-(5-methyl-1,2-oxazol-3-yl)-2-[(2-methyl-5,6,7,8-tetrahydro-[1]benzothiolo[2,3-d]pyrimidin-4-yl)sulfanyl]acetamide::N-(5-methyl-1,2-oxazol-3-yl)-2-[(2-methyl-5,6,7,8-tetrahydro-[1]benzothiolo[2,3-d]pyrimidin-4-yl)sulfanyl]ethanamide::N-(5-methyl-3-isoxazolyl)-2-[(2-methyl-5,6,7,8-tetrahydro-[1]benzothiolo[2,3-d]pyrimidin-4-yl)thio]acetamide::N-(5-methylisoxazol-3-yl)-2-[(2-methyl-5,6,7,8-tetrahydrobenzothiopheno[2,3-d]pyrimidin-4-yl)thio]acetamide::SMR000065167::cid_2612492
SMILES Cc1cc(NC(=O)CSc2nc(C)nc3sc4CCCCc4c23)no1
InChI Key InChIKey=YDIXFXKLOIDVCZ-UHFFFAOYSA-N
Data  3 IC50  2 EC50
  Tab Delimited (TSV)   2D SDfile   Computed 3D by Vconf -m prep SDfile
Find this compound or compounds like it in BindingDB:
Activity Spreadsheet -- Enzyme Inhibition Constant Data from BindingDB
Found 5 hits for monomerid = 67749
TargetDNA damage-inducible transcript 3 protein(Mus musculus)
Emory University
Curated by PubChem BioAssay
LigandPNGBDBM67749(MLS000056716 | N-(5-methyl-1,2-oxazol-3-yl)-2-[(2-...)
Affinity DataIC50: >1.00E+4nM. Assay description: NIH Molecular Libraries Screening Centers Network [MLSCN] Emory Chemical Biology Discovery Center in MLSCN Assay provider: Dr. Randal Kaufman, Univer...
In DepthDetails PCBioAssay
TargetX-box-binding protein 1(Homo sapiens (Human))
Emory University
Curated by PubChem BioAssay
LigandPNGBDBM67749(MLS000056716 | N-(5-methyl-1,2-oxazol-3-yl)-2-[(2-...)
Affinity DataIC50:  1.00E+4nM. Assay description: NIH Molecular Libraries Screening Centers Network [MLSCN] Emory Chemical Biology Discovery Center in MLSCN Assay provider: Dr. Randal Kaufman, Univer...
In DepthDetails PCBioAssay
TargetEndoribonuclease toxin MazF(Escherichia coli str. K-12 substr. MG1655)
Burnham Center For Chemical Genomics
Curated by PubChem BioAssay
LigandPNGBDBM67749(MLS000056716 | N-(5-methyl-1,2-oxazol-3-yl)-2-[(2-...)
Affinity DataEC50: >9.90E+4nM. Assay description: Data Source: Sanford-Burnham Center for Chemical Genomics (SBCCG) Source Affiliation: Sanford-Burnham Medical Research Institute (SBMRI, San Diego, C...
In DepthDetails PCBioAssay
TargetEndoribonuclease toxin MazF(Escherichia coli str. K-12 substr. MG1655)
Burnham Center For Chemical Genomics
Curated by PubChem BioAssay
LigandPNGBDBM67749(MLS000056716 | N-(5-methyl-1,2-oxazol-3-yl)-2-[(2-...)
Affinity DataEC50: >9.90E+4nM. Assay description: Data Source: Sanford-Burnham Center for Chemical Genomics (SBCCG) Source Affiliation: Sanford-Burnham Medical Research Institute (SBMRI, San Diego, C...
In DepthDetails PCBioAssay
TargetDNA damage-inducible transcript 3 protein(Mus musculus)
Emory University
Curated by PubChem BioAssay
LigandPNGBDBM67749(MLS000056716 | N-(5-methyl-1,2-oxazol-3-yl)-2-[(2-...)
Affinity DataIC50: >1.00E+4nM. Assay description: NIH Molecular Libraries Screening Centers Network [MLSCN] Emory Chemical Biology Discovery Center in MLSCN Assay provider: Dr. Randal Kaufman, Univer...
In DepthDetails PCBioAssay