Target
Oxysterols receptor LXR-beta
Ligand
BDBM304505
Substrate
Meas. Tech.
LXR alpha/beta Radioligand Binding Assay
Ki
1.000±n/a nM
Citation
 Claremon, DADong, CFan, YLeftheris, KLotesta, SDSingh, SBTice, CMZhao, WZheng, YZhuang, L Piperazine derivatives as liver X receptor modulators US Patent  US10144715 Publication Date 12/4/2018 
Target
Name:
Oxysterols receptor LXR-beta
Synonyms:
LXRB Liver X, LXR beta NR1H2 Nuclear receptor NER Ubiquitously-expressed nuclear receptor
Type:
Enzyme Catalytic Domain
Mol. Mass.:
50978.79
Organism:
Homo sapiens (Human)
Description:
P55055
Residue:
460
  
Inhibitor
Name:
BDBM304505
Synonyms:
(R)-5-chloro-2-(4-(4-fluoro-3-(methylsulfonyl)phenyl)-2-isopropylpiperazin-1-yl)-4-(trifluoromethyl)pyrimidine | US10144715, Compound 22-3
Type:
Small organic molecule
Emp. Form.:
C22H30ClFN4O2S
Mol. Mass.:
469.016
SMILES:
CC(C)[C@@H]1CN(CCN1c1ncc(Cl)c(n1)C(C)(C)C)c1ccc(F)c(c1)S(C)(=O)=O
: