Target
Oxysterols receptor LXR-beta
Ligand
BDBM304682
Substrate
Meas. Tech.
LXR alpha/beta Radioligand Binding Assay
Ki
3.00±n/a nM
Citation
 Claremon, DADong, CFan, YLeftheris, KLotesta, SDSingh, SBTice, CMZhao, WZheng, YZhuang, L Piperazine derivatives as liver X receptor modulators US Patent  US10144715 Publication Date 12/4/2018 
Target
Name:
Oxysterols receptor LXR-beta
Synonyms:
LXRB Liver X, LXR beta NR1H2 Nuclear receptor NER Ubiquitously-expressed nuclear receptor
Type:
Enzyme Catalytic Domain
Mol. Mass.:
50978.79
Organism:
Homo sapiens (Human)
Description:
P55055
Residue:
460
  
Inhibitor
Name:
BDBM304682
Synonyms:
(4-((S)-3-isopropyl-4-(((1s,4R)-4-methoxy-4-(trifluoromethyl)cyclohexyl)methyl)piperazin-1-yl)-2-(methylsulfonyl)phenyl)methanol | US10144715, Compound 48-80
Type:
Small organic molecule
Emp. Form.:
C24H37F3N2O4S
Mol. Mass.:
506.622
SMILES:
CO[C@@]1(CC[C@H](CN2CCN(C[C@@H]2C(C)C)c2ccc(CO)c(c2)S(C)(=O)=O)CC1)C(F)(F)F
: