Target
Proto-oncogene tyrosine-protein kinase receptor Ret
Ligand
BDBM370411
Substrate
Meas. Tech.
Measurement of RET Inhibitory Activity (In Vitro)
IC50
0.830±n/a nM
Citation
 Miyazaki, IShimamura, TKato, MFujita, H Fused pyrimidine compound or salt thereof US Patent  US11236096 Publication Date 2/1/2022 
Target
Name:
Proto-oncogene tyrosine-protein kinase receptor Ret
Synonyms:
CDHF12 Cadherin family member 12 Proto-oncogene c-Ret RET51 Tyrosine-protein kinase Ret (RET)
Type:
Protein
Mol. Mass.:
124318.29
Organism:
Homo sapiens (Human)
Description:
P07949
Residue:
1114
  
Inhibitor
Name:
BDBM370411
Synonyms:
US10233189, Example 61 US11014930, Example 61 | US11236096, Example 61
Type:
Small organic molecule
Emp. Form.:
C18H25N7O
Mol. Mass.:
355.4374
SMILES:
Cc1cc(NC(=O)c2cn(c3ncnc(N)c23)C(C)(C)C(C)(C)C)n[nH]1
: