Target
UDP-3-O-acyl-N-acetylglucosamine deacetylase
Ligand
BDBM563273
Substrate
Meas. Tech.
LpxC Binding Assay
IC50
<10±n/a nM
Citation
 Teng, MNammalwar, BLi, XPerez, CYule, IFaulkner, AAtton, HParkes, AConvers-Reignier, SSouthey, MPuerta, DT Antibacterial compounds US Patent  US11407740 Publication Date 8/9/2022 
Target
Name:
UDP-3-O-acyl-N-acetylglucosamine deacetylase
Synonyms:
LPXC_ECOLI UDP-3-O-[3-hydroxymyristoyl] N-acetylglucosamine deacetylase (LxpC) asmB lpxC
Type:
Enzyme
Mol. Mass.:
33952.00
Organism:
Escherichia coli
Description:
P0A725
Residue:
305
  
Inhibitor
Name:
BDBM563273
Synonyms:
US11407740, Compound 191
Type:
Small organic molecule
Emp. Form.:
C28H28F2N6O5
Mol. Mass.:
566.5559
SMILES:
Oc1c(CC(N2Cc3cc(cn3C2=O)C#Cc2ccc(CN3CCOCC3)cc2)C(=O)NCC(F)F)nc[nH]c1=O
: