Target
Caspase-3
Ligand
BDBM10351
Substrate
Caspase Fluorogenic Substrate
Meas. Tech.
Caspase Inhibition Assay
Ki
4.4±n/a nM
IC50
3.9±n/a nM
Citation
 Chu, WZhang, JZeng, CRothfuss, JTu, ZChu, YReichert, DEWelch, MJMach, RH N-benzylisatin sulfonamide analogues as potent caspase-3 inhibitors: synthesis, in vitro activity, and molecular modeling studies. J Med Chem 48:7637-47 (2005)  
Target
Name:
Caspase-3
Synonyms:
Apopain CASP3 CPP-32 Caspase 3 Caspase-3 subunit p17 SCA-1 Yama protein | caspase-3 preproprotein
Type:
Hydrolase; heterotetramer of two heterodimers
Mol. Mass.:
31607.55
Organism:
Homo sapiens (Human)
Description:
Residue:
277
  
Inhibitor
Name:
BDBM10351
Synonyms:
1-(4-Methoxybenzyl)-5-(2-(pyridin-3-yl-oxymethyl)-pyrolidine-1-sulfonyl)-1H-indole-2,3-dione Pyridine Analogue 21c
Type:
Small organic molecule
Emp. Form.:
C26H25N3O6S
Mol. Mass.:
507.558
SMILES:
COc1ccc(CN2C(=O)C(=O)c3cc(ccc23)S(=O)(=O)N2CCC[C@H]2COc2cccnc2)cc1
:
Substrate
Name:
Caspase Fluorogenic Substrate
Synonyms:
Ac-DEVD-AMC | Caspase Fluorogenic Substrate
Type:
Peptide
Mol. Mass.:
1461.77
Organism:
Description:
AMC=7-Amino-4-methylcoumarin
Residue:
16
ACASPGLVALASPAMC