Target
Caspase-7
Ligand
BDBM10352
Substrate
Caspase Fluorogenic Substrate
Meas. Tech.
Caspase Inhibition Assay
IC50
23.3±n/a nM
Citation
 Chu, WZhang, JZeng, CRothfuss, JTu, ZChu, YReichert, DEWelch, MJMach, RH N-benzylisatin sulfonamide analogues as potent caspase-3 inhibitors: synthesis, in vitro activity, and molecular modeling studies. J Med Chem 48:7637-47 (2005)  
Target
Name:
Caspase-7
Synonyms:
Apoptotic protease Mch-3 CASP7 CMH-1 MCH3 | caspase 7, apoptosis-related cysteine peptidase
Type:
Enzyme
Mol. Mass.:
34273.91
Organism:
Homo sapiens (Human)
Description:
P55210
Residue:
303
  
Inhibitor
Name:
BDBM10352
Synonyms:
1-(4-Methylthiobenzyl)-5-(2-(pyridin-3-yl-oxymethyl)-pyrrolidine-1-sulfonyl)-1H-indole-2,3-dione Pyridine Analogue 21d
Type:
Small organic molecule
Emp. Form.:
C26H25N3O5S2
Mol. Mass.:
523.624
SMILES:
CSc1ccc(CN2C(=O)C(=O)c3cc(ccc23)S(=O)(=O)N2CCC[C@H]2COc2cccnc2)cc1
:
Substrate
Name:
Caspase Fluorogenic Substrate
Synonyms:
Ac-DEVD-AMC | Caspase Fluorogenic Substrate
Type:
Peptide
Mol. Mass.:
1461.77
Organism:
Description:
AMC=7-Amino-4-methylcoumarin
Residue:
16
ACASPGLVALASPAMC