Target
Amine oxidase [flavin-containing] B
Ligand
BDBM10799
Substrate
BDBM10999
Meas. Tech.
MAO A and MAO B Activity Measurements
pH
7.5±n/a
Temperature
298.15±n/a K
Ki
17000±n/a nM
Citation
 Hubalek, FBinda, CLi, MHerzig, YSterling, JYoudim, MBMattevi, AEdmondson, DE Inactivation of purified human recombinant monoamine oxidases A and B by rasagiline and its analogues. J Med Chem 47:1760-6 (2004)  
Target
Name:
Amine oxidase [flavin-containing] B
Synonyms:
AOFB_HUMAN MAOB Monoamine oxidase type B (MAO B) Monoamine oxidase type B (MAOB)
Type:
Protein
Mol. Mass.:
58768.76
Organism:
Homo sapiens (Human)
Description:
P27338
Residue:
520
  
Inhibitor
Name:
BDBM10799
Synonyms:
(3R)-3-(prop-2-yn-1-ylamino)-2,3-dihydro-1H-inden-5-ol Aminoindan deriv. (R)39u R-HPAI | rasagiline analogue
Type:
Small organic molecule
Emp. Form.:
C12H13NO
Mol. Mass.:
187.2377
SMILES:
Oc1ccc2CC[C@@H](NCC#C)c2c1
:
Substrate
Name:
BDBM10999
Synonyms:
Benzenemethanamine CHEMBL522 phenylmethanamine
Type:
Small organic molecule
Emp. Form.:
C7H9N
Mol. Mass.:
107.1531
SMILES:
NCc1ccccc1
: