Target
Tyrosine-protein phosphatase non-receptor type 2
Ligand
BDBM13601
Substrate
BDBM13594
Meas. Tech.
PTP1B and TCPTP Inhibition Assay
pH
6.3±n/a
Temperature
295.15±n/a K
IC50
20±n/a nM
Citation
 Scapin, GPatel, SBBecker, JWWang, QDesponts, CWaddleton, DSkorey, KCromlish, WBayly, CTherien, MGauthier, JYLi, CSLau, CKRamachandran, CKennedy, BPAsante-Appiah, E The structural basis for the selectivity of benzotriazole inhibitors of PTP1B. Biochemistry 42:11451-9 (2003)  
Target
Name:
Tyrosine-protein phosphatase non-receptor type 2
Synonyms:
PTN2_HUMAN PTPT T-cell protein-tyrosine phosphatase TCPTP Tyrosine-protein phosphatase non-receptor type 2 (TC-PTP)
Type:
Protein
Mol. Mass.:
48481.80
Organism:
Homo sapiens (Human)
Description:
P17706
Residue:
415
  
Inhibitor
Name:
BDBM13601
Synonyms:
5-{4-[2-(1H-1,2,3-benzotriazol-1-yl)-3-{4-[difluoro(phosphono)methyl]phenyl}-2-phenylpropyl]phenyl}-2-(3-methylbutoxy)benzene-1-phosphonic acid | Aryldifluoromethyl-Phosphonic Acid Inhibitor 8
Type:
Small organic molecule
Emp. Form.:
C39H39F2N3O7P2
Mol. Mass.:
761.6872
SMILES:
CC(C)CCOc1ccc(cc1P(O)(O)=O)-c1ccc(CC(Cc2ccc(cc2)C(F)(F)P(O)(O)=O)(c2ccccc2)n2nnc3ccccc23)cc1
:
Substrate
Name:
BDBM13594
Synonyms:
Fluorescein diphosphate (FDP) fluorescein diphosphate, tetraammonium salt
Type:
Small organic molecule
Emp. Form.:
C20H10O11P2
Mol. Mass.:
488.2365
SMILES:
[O-]P([O-])(=O)Oc1ccc2c(Oc3cc(OP([O-])([O-])=O)ccc3C22OC(=O)c3ccccc23)c1
: