Target
Proto-oncogene tyrosine-protein kinase Src
Ligand
BDBM17730
Substrate
biotinylated gastrin substrate
Meas. Tech.
HTRF Kinase Inhibition Assay
IC50
1±n/a nM
Citation
 Martin, MWNewcomb, JNunes, JJMcGowan, DCArmistead, DMBoucher, CBuchanan, JLBuckner, WChai, LElbaum, DEpstein, LFFaust, TFlynn, SGallant, PGore, AGu, YHsieh, FHuang, XLee, JHMetz, DMiddleton, SMohn, DMorgenstern, KMorrison, MJNovak, PMOliveira-dos-Santos, APowers, DRose, PSchneider, SSell, STudor, YTurci, SMWelcher, AAWhite, RDZack, DZhao, HZhu, LZhu, XGhiron, CAmouzegh, PErmann, MJenkins, JJohnston, DNapier, SPower, E Novel 2-aminopyrimidine carbamates as potent and orally active inhibitors of Lck: synthesis, SAR, and in vivo antiinflammatory activity. J Med Chem 49:4981-91 (2006)  
Target
Name:
Proto-oncogene tyrosine-protein kinase Src
Synonyms:
Calmodulin/Proto-oncogene tyrosine-protein kinase Src Proto-oncogene c-Src SRC SRC_HUMAN V-src sarcoma (Schmidt-Ruppin A-2) viral oncogene homolog (avian) p60-Src | pp60c-src
Type:
Protein
Mol. Mass.:
59838.60
Organism:
Homo sapiens (Human)
Description:
P12931
Residue:
536
  
Inhibitor
Name:
BDBM17730
Synonyms:
2,6-dimethylphenyl N-[(2,5-dimethoxyphenyl)methyl]-N-(2-{[4-(4-methylpiperazin-1-yl)phenyl]amino}pyrimidin-4-yl)carbamate | 2-aminopyrimidine carbamate, 29
Type:
Small organic molecule
Emp. Form.:
C33H38N6O4
Mol. Mass.:
582.6926
SMILES:
COc1ccc(OC)c(CN(C(=O)Oc2c(C)cccc2C)c2ccnc(Nc3ccc(cc3)N3CCN(C)CC3)n2)c1
:
Substrate
Name:
biotinylated gastrin substrate
Synonyms:
Type:
Peptide
Mol. Mass.:
2100.22
Organism:
Description:
Residue:
17
ITINYLEEEEAYGWLDF